Home > Cannot Open > Usr/bin/ld Cannot Open Output File Git Is A Directory

Usr/bin/ld Cannot Open Output File Git Is A Directory

Contents

gopherbot commented Oct 18, 2013 Comment 2 by batuhangoksu: Thanks, OS = OS X Mountion Lion x64 $GOOS = darwin/amd64 sudo all.bash run # Building C bootstrap tool. Assigning only part of a string to a variable in bash Previous examples of large scale protests after Presidential elections in US? linux gcc makefile cmake assimp share|improve this question edited Jul 4 at 9:44 asked Jul 1 at 13:39 MaH relinace 11 add a comment| 1 Answer 1 active oldest votes up See also /opt/assimp2json/assimp/test/gtest/src/gtest-stamp/gtest-configure-*.log [ 85%] Performing build step for 'gtest' -- gtest build command succeeded. weblink

You signed in with another tab or window. When building from github dot com/assimp/assimp2json, the error "/usr/bin/ld: cannot open output file assimp2json: Is a directory" is produced. lib9 libbio libmach liblink misc/pprof cmd/addr2line cmd/objdump cmd/prof cmd/cc cmd/gc cmd/6l cmd/6a cmd/6c cmd/6g pkg/runtime /usr/local/go/src/pkg/runtime/debug.go:60: internal compiler error: fault go tool dist: FAILED: /usr/local/go/pkg/tool/darwin_amd64/6g -pack -o $WORK/_go_.a -p runtime -+ GEN git-instaweb SUBDIR git-gui MSGFMT po/de.msg make[1]: *** [po/de.msg] Error 127 make: *** [all] Error 2 git version-control share|improve this question edited Jan 3 '13 at 18:08 asked Jan 3 '13

/usr/bin/ld Cannot Open Output File Permission Denied

I decided to give this package more testing, hence my surprise when I tried it today. Do we know Ford's old name? ERROR: Failed to compile\nCheck the logs at /Users/ezo/.gvm/logs/go-go1.2.1-compile.log ERROR: Failed to use installed version [email protected] gominprices ☹ % cat /Users/ezo/.gvm/logs/go-go1.2.1-compile.log # Building C bootstrap tool. Problem with function inside brackets.

  • aurweb v4.4.1 Copyright © 2004-2016 aurweb Development Team.
  • What episode of Star Trek is this creature on?
  • more hot questions question feed about us tour help blog chat data legal privacy policy work here advertising info mobile contact us feedback Technology Life / Arts Culture / Recreation Science
  • And in my build folder after "vim CMakeFiles/tutorial_ectomodule.dir/link.txt", the line is different from the sitution of @SebastianRiedel in MY CASE: -o devel/lib/python2.7/ecto_tutorial/tutorial.so Here is my folder: https://drive.google.com/folderview?id=0B6lGtF9IuZWCd21ONEljQXBLMFE&usp=sharing Thanks very much!
  • GO OUT AND VOTE In the context of this quote, how many 'chips/sockets' do personal computers contain?
  • cryptonotefoundation closed this Aug 17, 2015 Sign up for free to join this conversation on GitHub.
  • This allow building specs in release mode in a much faster way.
  • I hope this helps in finding the error.
  • This uses 'git', the version control software, of which you can add code to from linux command line.

cmd/dist # Building compilers and Go bootstrap tool for host, darwin/amd64. Does Intel sell CPUs in ribbons? And changed line 34 of assimp/cmake-modules/AddGTest.cmake from "GIT_REPOSITORY chromium.googlesource dot com/external/googletest" to "GIT_REPOSITORY github dot com/google/googletest/". Cannot Open Output File Function Not Implemented Join them; it only takes a minute: Sign up Cannot open output file: Permission denied up vote 2 down vote favorite 1 so I'm completely new to Ubuntu.

Scheduling a task into a period within a day, depending on whether it is a weekend How to stop NPCs from picking up dropped items TIKZ: foreach not compatible with calc-library? See also /opt/assimp2json/assimp/test/gtest/src/gtest-stamp/gtest-build-*.log [ 86%] No install step for 'gtest' [ 86%] Completed 'gtest' [ 86%] Built target gtest Scanning dependencies of target unit [ 86%] Building C object assimp/test/CMakeFiles/unit.dir/unit/CCompilerTest.c.o [ And : May be you are using a too late g++ for the three year old code. Look at some other -git packages.

Or just build the package manually with makepkg. Cannot Open Output File 7zip Are other people able to build this and willing to share the trick? I'm a complete newb, so apologies. How can I save a file to a new location from inside Vim?

/usr/bin/ld Cannot Open Output File Is A Directory

See also /opt/assimp2json/assimp/test/gtest/src/gtest-stamp/gtest-download-*.log [ 84%] No patch step for 'gtest' [ 84%] Performing update step for 'gtest' Already on 'master' Your branch is up-to-date with 'origin/master'. [ 84%] Performing configure step it's Debian. /usr/bin/ld Cannot Open Output File Permission Denied Commands I use to build: " git clone https://github.com/assimp/assimp2json cd assimp2json git submodule init git submodule update cmake CMakeLists.txt make ". Ld Cannot Open Output File No Such File Or Directory How to stop NPCs from picking up dropped items Boss sends a birthday message.

As github dot com/assimp/assimp2json is forked from github dot com/acgessler/assimp2json which has more recent commits (2013 vs. 2015), I also tried building that with the same commands. have a peek at these guys cmd/dist # Building compilers and Go bootstrap tool for host, darwin/amd64. Even builds in a clean chroot. Deleting or moving the hello folder fixes the problem. /usr/bin/ld Cannot Open Output File No Such File Or Directory

Do I have to change the permission of the fileTest as well? regarding the errno=13 issue, this is normal as you are trying to build Go in /usr/local/go, where normal users don't have permission to write to. the GIT version you would like to install yum -y install openssl-devel.x86_64 libcurl-devel.x86_64 expat-devel.x86_64 perl-ExtUtils-MakeMaker.x86_64 gettext.x86_64 wget https://git-core.googlecode.com/files/git-${GIT_VERSION}.tar.gz tar -zxvf ./git-${GIT_VERSION}.tar.gz cd git-${GIT_VERSION} make prefix=/usr/local install # to install in /usr/local http://rinfix.com/cannot-open/usr-bin-ld-cannot-open-output-file-test-is-a-directory.html Any further issues ?

I believe it is just a caching mechanism for the build to download the ffmpeg dependencies all at once instead of getting each separate tar from upstream sources. Collect2: Error: Ld Returned 1 Exit Status Type echo $PWD and post here the result –Helio May 15 '14 at 21:15 1 Do you get any error from touch fileTest? –Ben Voigt May 15 '14 at 21:16 I'm close yet so far from getting it compiled.

zman0900 commented on 2016-03-14 07:31 Over the air EPG support for ATSC is now in main tvheadend for the 4.2 release, so I have requested this tvheadend-atsc-epg-git package merge with tvheadend-git.

jmason commented on 2016-02-14 23:28 Trying again, I now see there's a very early error that zips by after the initial checks: make -f Makefile.ffmpeg make[1]: Entering directory '/home/echo/build/tvheadend-git/src/tvheadend-git' DOWNLOAD https://dl.bintray.com/tvheadend/misc/staticlib//armv7l/ffmpeg-8906a8edddc1b828395d042ba17eef5752f2b915.tgz AlbertWerner commented Aug 14, 2015 You have two seeds (52.76.35.104:33658 and 52.76.36.93:33658), that are unalienable. lib9 libbio libmach misc/pprof cmd/addr2line cmd/nm cmd/objdump cmd/pack cmd/prof cmd/cc cmd/gc /usr/local/go/src/cmd/gc/lex.c:564:31: error: array index of '1' indexes past the end of an array (that contains 1 elements) [-Werror,-Warray-bounds] /usr/local/go/src/cmd/gc/go.h:81:2: note: Collect2 Ld Returned 1 Exit Status pejobo commented on 2015-12-13 12:31 ..and "provides" should be set to 'tvheadend-git' squ commented on 2015-12-10 07:45 When compiling from yaourt, _gitname='tvheadend' in PKGBUILD has to be changed to something else,

Bug? lib9 libbio libmach liblink misc/pprof cmd/addr2line cmd/objdump cmd/prof cmd/cc cmd/gc cmd/6l cmd/6a cmd/6c cmd/6g pkg/runtime /usr/local/go/src/pkg/runtime/debug.go:60: internal compiler error: fault go tool dist: FAILED: /usr/local/go/pkg/tool/darwin_amd64/6g -pack -o $WORK/_go_.a -p runtime -+ Problem with function inside brackets. this content zman0900 commented on 2015-08-10 21:11 Old maintainer seems to be missing so I went ahead and took this over since I already have tvheadend-atsc-epg-git.

Calculating ...5(5+4(4+3(3+2(2+1(1))))) US Election results 2016: What went wrong with prediction models? Assistance would be appreciated. cmd/dist # Building compilers and Go bootstrap tool for host, darwin/amd64. Not the answer you're looking for?

Also when I use touch, it says: Permission denied –DigiSweep May 15 '14 at 21:23 add a comment| 2 Answers 2 active oldest votes up vote 0 down vote accepted Try Update message @ 25/04/2016 I solved the problem by installing the new update and re-installing all the Necessary dependencies. I won't change "provides" because it should be the name of the package the git version is replacing. Bug?

hissingshark commented on 2016-02-08 12:01 I've successfully compiled this a few times on the rpi2. I don't recall any problem with installing it back then. Running a "diff" on the last Dec. 19th commit shows a version change: - pkgver = 4.1.r442.g824f46e + pkgver = 4.1.r1235.gd822a74 I’m not sure if this is just an innocuous package Sign in to comment Contact GitHub API Training Shop Blog About © 2016 GitHub, Inc.

However, when I tried to do this it came up with a bunch of errors. Labels changed: removed priority-triage. When I run the daemon, it seems to connect, but i get this: 2015-Aug-13 14:49:02.631086 [P2P0]Failed to connect to any of seed peers, continuing without seeds a bunch of times. I've set up a shared folder with a few c programs and when I go to compile in Ubuntu, such as: gcc file.c -o fileTest I get the following error: /usr/bin/ld:

Or are others failing to and should I look at other software? Reload to refresh your session. endre commented on 2015-09-05 08:10 Hi there, Thanks for adopting this package, but build fails with compilation of the tveadend binary itself: CC tvheadend /usr/bin/ld: cannot open output file /tmp/yaourt-tmp-e/aur-tvheadend-git/tvheadend: Is Download in other formats: Comma-delimited Text Tab-delimited Text RSS Feed Powered by Trac 1.0.13 By Edgewall Software.

It seems to working. It seems that it somehow looses or modifies the definition of some of the variables in the PKGBUILD, which causes it to cd into the wrong working directory.